build breakage due to crypto_hash_finish patch

Ben Greear greearb at candelatech.com
Fri Jul 6 19:35:06 EDT 2012


I'm seeing build failures on Fedora 11 and some other older systems..
I think this is due to a recent patch.

Y -DEAP_SERVER -DPKCS12_FUNCS -DEAP_TLS_FUNCS -DCONFIG_SHA256 -DALL_DH_GROUPS -DCONFIG_IPV6 -DNEED_AP_MLME -DCONFIG_DEBUG_FILE ../src/crypto/crypto_openssl.c
../src/crypto/crypto_openssl.c: In function ‘crypto_hash_init’:
../src/crypto/crypto_openssl.c:575: error: void value not ignored as it ought to be
../src/crypto/crypto_openssl.c: In function ‘crypto_hash_finish’:
../src/crypto/crypto_openssl.c:606: error: void value not ignored as it ought to be
make[1]: Leaving directory `/home/greearb/git/btbits/3plibs/hostap/hostapd'
make[1]: *** [../src/crypto/crypto_openssl.o] Error 1

I'll look into it later if no one beats me to it.

Thanks,
Ben

-- 
Ben Greear <greearb at candelatech.com>
Candela Technologies Inc  http://www.candelatech.com




More information about the HostAP mailing list