2.6.11.6 compilation error

Aaron Dummer aaron at dummer.info
Mon Aug 15 14:38:06 EDT 2005


Hello,

I applied the 0.3.9 kernel patches to a 2.6.11.6 source tree without
issue.  However, this error is given when compiling:

drivers/net/wireless/hostap_plx.o: In function `prism2_suspend':
hostap_plx.c:(.text+0x57c0): multiple definition of `prism2_suspend'
drivers/net/wireless/hostap_cs.o:hostap_cs.c:(.text+0x57b0): first
defined here
drivers/net/wireless/hostap_pci.o: In function `prism2_suspend':
hostap_pci.c:(.text+0x57a0): multiple definition of `prism2_suspend'
drivers/net/wireless/hostap_cs.o:hostap_cs.c:(.text+0x57b0): first
defined here
make[4]: *** [drivers/net/wireless/built-in.o] Error 1
make[3]: *** [drivers/net/wireless] Error 2
make[2]: *** [drivers/net] Error 2
make[1]: *** [drivers] Error 2
make[1]: Leaving directory `/usr/src/linux-2.6.11.6'
make: *** [stamp-build] Error 2


I've tried compiling using gcc 3.x and 4.0, same result.  Anybody know
what this means and how to fix it?

Thanks.




More information about the HostAP mailing list